{"text_format":"3","workbook":"xlsx","n_sheets":26,"sheets":["Home","Data","RateVol","LnBal","RelBal","RSBal","LnPct","RelPct","NIINIE","LnYld","SFYld","RelCost","RSCost","NIM","NII","NIE","Effic","EOS","NCO","PLLExp","LLRPct","TSR","EqAssets","NetInc","ROA","RateVolData"],"not_rendered":{"charts":22,"macros":1,"defined_names":142},"read":"whole","date_system":"1900"}

{"sheet":"Home","index":0,"n_rows":23,"n_cols":4,"rows_kept":23}
[]
[null,"Home Page / Table of Contents"]
[]
[null,"Data Entry and Summary Analysis",null,"Non-Interest Items"]
[null,"Current Year Actual and Upcoming Budget Summary Financials",null,"Non-Interest Income"]
[null,"Summary Budget Analysis (Rate Vs. Volume)",null,"Non-Interest Expense"]
[]
[null,"Balance Growth",null,"Efficiency and Economy of Scale"]
{"$rows_left_out":16}
{"sheet":"Data","index":1,"n_rows":61,"n_cols":37,"rows_kept":61,"merged":[[3,2,5,2],[3,4,3,16],[3,18,3,29]]}
[]
[null,null,2,null,4,5,6,7,8,9,10,11,12,13,14,15,16,null,18,19,20,21,22,23,24,25,26,27,28,29,null,31,32,33,34,35,36]
[]
[null,null,"Please enter all values in THOUSANDS of dollars.",null,"Current Year Performance",{"$nulls":13},"Upcoming Budget"]
[]
[{"$nulls":4},"2021-12-31",{"$f":"EOMONTH(E6,1)","v":"2022-01-31"},{"$f":"EOMONTH(F6,1)","v":"2022-02-28"},"2022-03-31","2022-04-30","2022-05-31","2022-06-30","2022-07-31","2022-08-31","2022-09-30","2022-10-31","2022-11-30","2022-12-31",null,{"$f":"EOMONTH(Q6,1)","v":"2023-01-31"},"2023-02-28","2023-03-31","2023-04-30","2023-05-31","2023-06-30","2023-07-31","2023-08-31","2023-09-30","2023-10-31","2023-11-30","2023-12-31",null,"Prior Avg","Bud Avg","Change","Pct Chg","End Chg","Pct Chg"]
[]
[null,"B1","Gross Loans",{"$nulls":28},{"$f":"IFERROR(AVERAGE(E8:Q8),0)","v":{"v":0,"d":"0 "}},{"$f":"IFERROR(AVERAGE(Q8,S8:AD8),0)","v":{"v":0,"d":"0 "}},{"$f":"AG8-AF8","v":{"v":0,"d":"0 "}},{"$f":"IFERROR(AH8/AF8,0)","v":{"v":0,"d":"0.0%"}},{"$f":"AD8-Q8","v":{"v":0,"d":"0 "}},{"$f":"IFERROR(AJ8/Q8,0)","v":{"v":0,"d":"0.0%"}}]
{"$rows_left_out":54}
{"sheet":"RateVol","index":2,"n_rows":37,"n_cols":18,"rows_kept":37,"merged":[[33,9,34,9]]}
[]
[]
[null,null,{"$f":"_xlfn.CONCAT(TEXT(Data!AD6,\"yyy\"),\" Budget Analysis\")","v":"2023 Budget Analysis"}]
[]
[{"$nulls":4},{"$f":"_xlfn.CONCAT(\"Actual \",TEXT(Data!Q6,\"yyy\"))","v":"Actual 2022"},{"$f":"_xlfn.CONCAT(\"Budget \",TEXT(Data!AD6,\"yyy\"))","v":"Budget 2023"},"Change","Pct Chg","Impact","Impact Chart",null,null,false,"Show Detail"]
[null,null,"Consumption"]
[null,"NIE","Non-Interest Expense",null,{"$f":"VLOOKUP($B7,RateVolData!$B:$K,2,FALSE)","v":0},{"$f":"VLOOKUP($B7,RateVolData!$B:$K,3,FALSE)","v":0},{"$f":"VLOOKUP($B7,RateVolData!$B:$K,5,FALSE)","v":0},{"$f":"IFERROR(G7/E7,0)","v":{"v":0,"d":"0.0%"}},{"$f":"VLOOKUP($B7,RateVolData!$B:$K,10,FALSE)","v":0},{"$f":"I7","v":0}]
[null,"PLL","Provision for Loan Loss Expense",null,{"$f":"VLOOKUP($B8,RateVolData!$B:$K,2,FALSE)","v":0},{"$f":"VLOOKUP($B8,RateVolData!$B:$K,3,FALSE)","v":0},{"$f":"VLOOKUP($B8,RateVolData!$B:$K,5,FALSE)","v":0},{"$f":"IFERROR(G8/E8,0)","v":{"v":0,"d":"0.0%"}},{"$f":"VLOOKUP($B8,RateVolData!$B:$K,10,FALSE)","v":0},0]
{"$rows_left_out":30}
{"sheet":"LnBal","index":3,"n_rows":87,"n_cols":27,"rows_kept":87}
{"$rows_empty":31}
[{"$nulls":3},{"$f":"\"Gap Between \"&TEXT(EOMONTH(BeginDate,12),\"mmm yyy\")&\" and \"&TEXT(EOMONTH(BeginDate,13),\"mmm yyy\")","v":"Gap Between Dec 2022 and Jan 2023"},{"$nulls":5},{"$f":"VLOOKUP(DataID,DataRange,Data!S$2,FALSE)-VLOOKUP(DataID,DataRange,Data!Q$2,FALSE)","v":{"v":0,"d":"0 m"}},{"$f":"IFERROR(_xlfn.CONCAT(\"<-- Gap Equal to \",TEXT((J32*RateVolData!I3)/AVERAGE(Data!$E$12:$Q$12),\"0.00%\"),\" ROA\"),0)","v":0}]
[{"$nulls":3},"Growth in Ending Balance",{"$nulls":4},{"$f":"VLOOKUP(DataID,DataRange,Data!$AK$2,FALSE)","v":{"v":0,"d":"0.0%"}},{"$f":"VLOOKUP(DataID,DataRange,Data!$AJ$2,FALSE)","v":{"v":0,"d":"0 m"}}]
[{"$nulls":3},"Growth in Average Daily Balance",{"$nulls":4},{"$f":"VLOOKUP(DataID,DataRange,Data!$AI$2,FALSE)","v":{"v":0,"d":"0.0%"}},{"$f":"VLOOKUP(DataID,DataRange,Data!$AH$2,FALSE)","v":{"v":0,"d":"0 m"}},{"$f":"IFERROR(_xlfn.CONCAT(\"<-- Produces \",TEXT(ROUND(ABS(VLOOKUP(DataID,RateVolData!$A:$K,11,FALSE))*1000,-3),\"$#,##0\"),\" Earnings \",IF(VLOOKUP(DataID,RateVolData!$A:$K,11,FALSE)>=0,\"Lift\",\"Drag\")),\"\")","v":"<-- Produces $0 Earnings Lift"}]
[]
[]
[null,"Comments/Observations:"]
{"$rows_empty":34}
{"$rows_left_out":17}
{"sheet":"RelBal","index":4,"n_rows":87,"n_cols":27,"rows_kept":87}
{"$rows_empty":31}
[{"$nulls":3},{"$f":"\"Gap Between \"&TEXT(EOMONTH(BeginDate,12),\"mmm yyy\")&\" and \"&TEXT(EOMONTH(BeginDate,13),\"mmm yyy\")","v":"Gap Between Dec 2022 and Jan 2023"},{"$nulls":5},{"$f":"VLOOKUP(DataID,DataRange,Data!S$2,FALSE)-VLOOKUP(DataID,DataRange,Data!Q$2,FALSE)","v":{"v":0,"d":"0 m"}},{"$f":"IFERROR(_xlfn.CONCAT(\"<-- Gap Equal to \",TEXT((J32*RateVolData!I8)/AVERAGE(Data!$E$12:$Q$12),\"0.00%\"),\" ROA\"),0)","v":0}]
[{"$nulls":3},"Growth in Ending Balance",{"$nulls":4},{"$f":"VLOOKUP(DataID,DataRange,Data!$AK$2,FALSE)","v":{"v":0,"d":"0.0%"}},{"$f":"VLOOKUP(DataID,DataRange,Data!$AJ$2,FALSE)","v":{"v":0,"d":"0 m"}}]
[{"$nulls":3},"Growth in Average Daily Balance",{"$nulls":4},{"$f":"VLOOKUP(DataID,DataRange,Data!$AI$2,FALSE)","v":{"v":0,"d":"0.0%"}},{"$f":"VLOOKUP(DataID,DataRange,Data!$AH$2,FALSE)","v":{"v":0,"d":"0 m"}},{"$f":"IFERROR(_xlfn.CONCAT(\"<-- Produces \",TEXT(ROUND(ABS(VLOOKUP(DataID,RateVolData!$A:$K,11,FALSE))*1000,-3),\"$#,##0\"),\" Earnings \",IF(VLOOKUP(DataID,RateVolData!$A:$K,11,FALSE)>=0,\"Lift\",\"Drag\")),\"\")","v":"<-- Produces $0 Earnings Lift"}]
[]
[]
[null,"Comments/Observations:"]
{"$rows_empty":34}
{"$rows_left_out":17}
{"sheet":"RSBal","index":5,"n_rows":87,"n_cols":27,"rows_kept":87}
{"$rows_empty":31}
[{"$nulls":3},{"$f":"\"Gap Between \"&TEXT(EOMONTH(BeginDate,12),\"mmm yyy\")&\" and \"&TEXT(EOMONTH(BeginDate,13),\"mmm yyy\")","v":"Gap Between Dec 2022 and Jan 2023"},{"$nulls":5},{"$f":"VLOOKUP(DataID,DataRange,Data!S$2,FALSE)-VLOOKUP(DataID,DataRange,Data!Q$2,FALSE)","v":{"v":0,"d":"0 m"}},{"$f":"IFERROR(_xlfn.CONCAT(\"<-- Gap Equal to \",TEXT((J32*RateVolData!I9)/AVERAGE(Data!$E$12:$Q$12),\"0.00%\"),\" ROA\"),0)","v":0}]
[{"$nulls":3},"Growth in Ending Balance",{"$nulls":4},{"$f":"VLOOKUP(DataID,DataRange,Data!$AK$2,FALSE)","v":{"v":0,"d":"0.0%"}},{"$f":"VLOOKUP(DataID,DataRange,Data!$AJ$2,FALSE)","v":{"v":0,"d":"0 m"}}]
[{"$nulls":3},"Growth in Average Daily Balance",{"$nulls":4},{"$f":"VLOOKUP(DataID,DataRange,Data!$AI$2,FALSE)","v":{"v":0,"d":"0.0%"}},{"$f":"VLOOKUP(DataID,DataRange,Data!$AH$2,FALSE)","v":{"v":0,"d":"0 m"}},{"$f":"IFERROR(_xlfn.CONCAT(\"<-- Produces \",TEXT(ROUND(ABS(VLOOKUP(DataID,RateVolData!$A:$K,11,FALSE))*1000,-3),\"$#,##0\"),\" Earnings \",IF(VLOOKUP(DataID,RateVolData!$A:$K,11,FALSE)>=0,\"Lift\",\"Drag\")),\"\")","v":"<-- Produces $0 Earnings Lift"}]
[]
[]
[null,"Comments/Observations:"]
{"$rows_empty":34}
{"$rows_left_out":17}
{"sheet":"LnPct","index":6,"n_rows":87,"n_cols":26,"rows_kept":87}
{"$rows_empty":31}
[{"$nulls":3},{"$f":"\"Gap Between \"&TEXT(EOMONTH(BeginDate,12),\"mmm yyy\")&\" and \"&TEXT(EOMONTH(BeginDate,13),\"mmm yyy\")","v":"Gap Between Dec 2022 and Jan 2023"},{"$nulls":5},{"$f":"VLOOKUP(DataID,DataRange,Data!S$2,FALSE)-VLOOKUP(DataID,DataRange,Data!Q$2,FALSE)","v":{"v":0,"d":"0.0%"}}]
[]
[]
[]
[]
[null,"Comments/Observations:"]
{"$rows_empty":34}
{"$rows_left_out":17}
{"sheet":"RelPct","index":7,"n_rows":87,"n_cols":26,"rows_kept":87}
{"$rows_empty":31}
[{"$nulls":3},{"$f":"\"Gap Between \"&TEXT(EOMONTH(BeginDate,12),\"mmm yyy\")&\" and \"&TEXT(EOMONTH(BeginDate,13),\"mmm yyy\")","v":"Gap Between Dec 2022 and Jan 2023"},{"$nulls":5},{"$f":"VLOOKUP(DataID,DataRange,Data!S$2,FALSE)-VLOOKUP(DataID,DataRange,Data!Q$2,FALSE)","v":{"v":0,"d":"0.0%"}}]
[]
[]
[]
[]
[null,"Comments/Observations:"]
{"$rows_empty":34}
{"$rows_left_out":17}
{"sheet":"NIINIE","index":8,"n_rows":87,"n_cols":26,"rows_kept":87}
{"$rows_empty":31}
[{"$nulls":3},{"$f":"\"Gap Between \"&TEXT(EOMONTH(BeginDate,12),\"mmm yyy\")&\" and \"&TEXT(EOMONTH(BeginDate,13),\"mmm yyy\")","v":"Gap Between Dec 2022 and Jan 2023"},{"$nulls":5},{"$f":"VLOOKUP(DataID,DataRange,Data!S$2,FALSE)-VLOOKUP(DataID,DataRange,Data!Q$2,FALSE)","v":{"v":0,"d":"0.0%"}}]
[{"$nulls":3},{"$f":"\"Average Ratio in \"&TEXT(EOMONTH(BeginDate,12),\"yyy\")","v":"Average Ratio in 2022"},{"$nulls":5},{"$f":"VLOOKUP(DataID,DataRange,Data!$AF$2,FALSE)","v":{"v":0,"d":"0.0%"}}]
[{"$nulls":3},{"$f":"\"Budget Ratio in \"&TEXT(EOMONTH(BeginDate,24),\"yyy\")","v":"Budget Ratio in 2023"},{"$nulls":5},{"$f":"VLOOKUP(DataID,DataRange,Data!$AG$2,FALSE)","v":{"v":0,"d":"0.0%"}}]
[]
[]
[null,"Comments/Observations:"]
{"$rows_empty":34}
{"$rows_left_out":17}
{"sheet":"LnYld","index":9,"n_rows":87,"n_cols":26,"rows_kept":87}
{"$rows_empty":31}
[{"$nulls":3},{"$f":"\"Gap Between \"&TEXT(EOMONTH(BeginDate,12),\"mmm yyy\")&\" and \"&TEXT(EOMONTH(BeginDate,13),\"mmm yyy\")","v":"Gap Between Dec 2022 and Jan 2023"},{"$nulls":5},{"$f":"VLOOKUP(DataID,DataRange,Data!S$2,FALSE)-VLOOKUP(DataID,DataRange,Data!Q$2,FALSE)","v":{"v":0,"d":"0.00%"}},{"$f":"IFERROR(_xlfn.CONCAT(\"<-- Gap Equal to \",TEXT((J32*RateVolData!D3)/AVERAGE(Data!$E$12:$Q$12),\"0.00%\"),\" ROA\"),0)","v":0}]
[{"$nulls":3},{"$f":"\"Average Yield in \"&TEXT(EOMONTH(BeginDate,12),\"yyy\")","v":"Average Yield in 2022"},{"$nulls":5},{"$f":"VLOOKUP(DataID,DataRange,Data!$AF$2,FALSE)","v":{"v":0,"d":"0.00%"}}]
[{"$nulls":3},{"$f":"\"Budget Yield in \"&TEXT(EOMONTH(BeginDate,24),\"yyy\")","v":"Budget Yield in 2023"},{"$nulls":5},{"$f":"VLOOKUP(DataID,DataRange,Data!$AG$2,FALSE)","v":{"v":0,"d":"0.00%"}}]
[{"$nulls":3},"Change in Yield",{"$nulls":5},{"$f":"VLOOKUP(DataID,DataRange,Data!$AH$2,FALSE)","v":{"v":0,"d":"0.00%"}},{"$f":"IFERROR(_xlfn.CONCAT(\"<-- Produces \",TEXT(ROUND(ABS(VLOOKUP(DataID,RateVolData!$A:$K,11,FALSE))*1000,-3),\"$#,##0\"),\" Earnings \",IF(VLOOKUP(DataID,RateVolData!$A:$K,11,FALSE)>=0,\"Lift\",\"Drag\")),\"\")","v":"<-- Produces $0 Earnings Lift"}]
[]
[null,"Comments/Observations:"]
{"$rows_empty":34}
{"$rows_left_out":17}
{"sheet":"SFYld","index":10,"n_rows":87,"n_cols":26,"rows_kept":87}
{"$rows_empty":31}
[{"$nulls":3},{"$f":"\"Gap Between \"&TEXT(EOMONTH(BeginDate,12),\"mmm yyy\")&\" and \"&TEXT(EOMONTH(BeginDate,13),\"mmm yyy\")","v":"Gap Between Dec 2022 and Jan 2023"},{"$nulls":5},{"$f":"VLOOKUP(DataID,DataRange,Data!S$2,FALSE)-VLOOKUP(DataID,DataRange,Data!Q$2,FALSE)","v":{"v":0,"d":"0.00%"}},{"$f":"IFERROR(_xlfn.CONCAT(\"<-- Gap Equal to \",TEXT((J32*RateVolData!D4)/AVERAGE(Data!$E$12:$Q$12),\"0.00%\"),\" ROA\"),0)","v":0}]
[{"$nulls":3},{"$f":"\"Average Yield in \"&TEXT(EOMONTH(BeginDate,12),\"yyy\")","v":"Average Yield in 2022"},{"$nulls":5},{"$f":"VLOOKUP(DataID,DataRange,Data!$AF$2,FALSE)","v":{"v":0,"d":"0.00%"}}]
[{"$nulls":3},{"$f":"\"Budget Yield in \"&TEXT(EOMONTH(BeginDate,24),\"yyy\")","v":"Budget Yield in 2023"},{"$nulls":5},{"$f":"VLOOKUP(DataID,DataRange,Data!$AG$2,FALSE)","v":{"v":0,"d":"0.00%"}}]
[{"$nulls":3},"Change in Yield",{"$nulls":5},{"$f":"VLOOKUP(DataID,DataRange,Data!$AH$2,FALSE)","v":{"v":0,"d":"0.00%"}},{"$f":"IFERROR(_xlfn.CONCAT(\"<-- Produces \",TEXT(ROUND(ABS(VLOOKUP(DataID,RateVolData!$A:$K,11,FALSE))*1000,-3),\"$#,##0\"),\" Earnings \",IF(VLOOKUP(DataID,RateVolData!$A:$K,11,FALSE)>=0,\"Lift\",\"Drag\")),\"\")","v":"<-- Produces $0 Earnings Lift"}]
[]
[null,"Comments/Observations:"]
{"$rows_empty":34}
{"$rows_left_out":17}
{"sheet":"RelCost","index":11,"n_rows":87,"n_cols":26,"rows_kept":87}
{"$rows_empty":31}
[{"$nulls":3},{"$f":"\"Gap Between \"&TEXT(EOMONTH(BeginDate,12),\"mmm yyy\")&\" and \"&TEXT(EOMONTH(BeginDate,13),\"mmm yyy\")","v":"Gap Between Dec 2022 and Jan 2023"},{"$nulls":5},{"$f":"VLOOKUP(DataID,DataRange,Data!S$2,FALSE)-VLOOKUP(DataID,DataRange,Data!Q$2,FALSE)","v":{"v":0,"d":"0.00%"}},{"$f":"IFERROR(_xlfn.CONCAT(\"<-- Gap Equal to \",TEXT(-(J32*RateVolData!D8)/AVERAGE(Data!$E$12:$Q$12),\"0.00%\"),\" ROA\"),0)","v":0}]
[{"$nulls":3},{"$f":"\"Average Cost in \"&TEXT(EOMONTH(BeginDate,12),\"yyy\")","v":"Average Cost in 2022"},{"$nulls":5},{"$f":"VLOOKUP(DataID,DataRange,Data!$AF$2,FALSE)","v":{"v":0,"d":"0.00%"}}]
[{"$nulls":3},{"$f":"\"Budget Cost in \"&TEXT(EOMONTH(BeginDate,24),\"yyy\")","v":"Budget Cost in 2023"},{"$nulls":5},{"$f":"VLOOKUP(DataID,DataRange,Data!$AG$2,FALSE)","v":{"v":0,"d":"0.00%"}}]
[{"$nulls":3},"Change in Cost",{"$nulls":5},{"$f":"VLOOKUP(DataID,DataRange,Data!$AH$2,FALSE)","v":{"v":0,"d":"0.00%"}},{"$f":"IFERROR(_xlfn.CONCAT(\"<-- Produces \",TEXT(ROUND(ABS(VLOOKUP(DataID,RateVolData!$A:$K,11,FALSE))*1000,-3),\"$#,##0\"),\" Earnings \",IF(VLOOKUP(DataID,RateVolData!$A:$K,11,FALSE)>=0,\"Lift\",\"Drag\")),\"\")","v":"<-- Produces $0 Earnings Lift"}]
[]
[null,"Comments/Observations:"]
{"$rows_empty":34}
{"$rows_left_out":17}
{"sheet":"RSCost","index":12,"n_rows":87,"n_cols":26,"rows_kept":87}
{"$rows_empty":31}
[{"$nulls":3},{"$f":"\"Gap Between \"&TEXT(EOMONTH(BeginDate,12),\"mmm yyy\")&\" and \"&TEXT(EOMONTH(BeginDate,13),\"mmm yyy\")","v":"Gap Between Dec 2022 and Jan 2023"},{"$nulls":5},{"$f":"VLOOKUP(DataID,DataRange,Data!S$2,FALSE)-VLOOKUP(DataID,DataRange,Data!Q$2,FALSE)","v":{"v":0,"d":"0.00%"}},{"$f":"IFERROR(_xlfn.CONCAT(\"<-- Gap Equal to \",TEXT(-(J32*RateVolData!D9)/AVERAGE(Data!$E$12:$Q$12),\"0.00%\"),\" ROA\"),0)","v":0}]
[{"$nulls":3},{"$f":"\"Average Cost in \"&TEXT(EOMONTH(BeginDate,12),\"yyy\")","v":"Average Cost in 2022"},{"$nulls":5},{"$f":"VLOOKUP(DataID,DataRange,Data!$AF$2,FALSE)","v":{"v":0,"d":"0.00%"}}]
[{"$nulls":3},{"$f":"\"Budget Cost in \"&TEXT(EOMONTH(BeginDate,24),\"yyy\")","v":"Budget Cost in 2023"},{"$nulls":5},{"$f":"VLOOKUP(DataID,DataRange,Data!$AG$2,FALSE)","v":{"v":0,"d":"0.00%"}}]
[{"$nulls":3},"Change in Cost",{"$nulls":5},{"$f":"VLOOKUP(DataID,DataRange,Data!$AH$2,FALSE)","v":{"v":0,"d":"0.00%"}},{"$f":"IFERROR(_xlfn.CONCAT(\"<-- Produces \",TEXT(ROUND(ABS(VLOOKUP(DataID,RateVolData!$A:$K,11,FALSE))*1000,-3),\"$#,##0\"),\" Earnings \",IF(VLOOKUP(DataID,RateVolData!$A:$K,11,FALSE)>=0,\"Lift\",\"Drag\")),\"\")","v":"<-- Produces $0 Earnings Lift"}]
[]
[null,"Comments/Observations:"]
{"$rows_empty":34}
{"$rows_left_out":17}
{"sheet":"NIM","index":13,"n_rows":87,"n_cols":26,"rows_kept":87}
{"$rows_empty":31}
[{"$nulls":3},{"$f":"\"Gap Between \"&TEXT(EOMONTH(BeginDate,12),\"mmm yyy\")&\" and \"&TEXT(EOMONTH(BeginDate,13),\"mmm yyy\")","v":"Gap Between Dec 2022 and Jan 2023"},{"$nulls":5},{"$f":"VLOOKUP(DataID,DataRange,Data!S$2,FALSE)-VLOOKUP(DataID,DataRange,Data!Q$2,FALSE)","v":{"v":0,"d":"0.00%"}}]
[{"$nulls":3},{"$f":"\"Average Net Interest Margin in \"&TEXT(EOMONTH(BeginDate,12),\"yyy\")","v":"Average Net Interest Margin in 2022"},{"$nulls":5},{"$f":"VLOOKUP(DataID,DataRange,Data!$AF$2,FALSE)","v":{"v":0,"d":"0.00%"}}]
[{"$nulls":3},{"$f":"\"Budget Net Interest Margin in \"&TEXT(EOMONTH(BeginDate,24),\"yyy\")","v":"Budget Net Interest Margin in 2023"},{"$nulls":5},{"$f":"VLOOKUP(DataID,DataRange,Data!$AG$2,FALSE)","v":{"v":0,"d":"0.00%"}}]
[{"$nulls":3},"Change in Net Interest Margin",{"$nulls":5},{"$f":"VLOOKUP(DataID,DataRange,Data!$AH$2,FALSE)","v":{"v":0,"d":"0.00%"}}]
[]
[null,"Comments/Observations:"]
{"$rows_empty":34}
{"$rows_left_out":17}
{"sheet":"NII","index":14,"n_rows":87,"n_cols":26,"rows_kept":87}
{"$rows_empty":31}
[{"$nulls":3},{"$f":"B78&\" in \"&TEXT(EOMONTH(BeginDate,12),\"yyy\")","v":"Non-Interest Income in 2022"},{"$nulls":5},{"$f":"VLOOKUP(DataID,DataRange,Data!$AF$2,FALSE)","v":{"v":0,"d":"0 "}}]
[{"$nulls":3},{"$f":"\"Budget \"&B78&\" in \"&TEXT(EOMONTH(BeginDate,24),\"yyy\")","v":"Budget Non-Interest Income in 2023"},{"$nulls":5},{"$f":"VLOOKUP(DataID,DataRange,Data!$AG$2,FALSE)","v":{"v":0,"d":"0 "}}]
[{"$nulls":3},{"$f":"\"Change in \"&B78","v":"Change in Non-Interest Income"},{"$nulls":4},{"$f":"IFERROR(J34/J32,0)","v":{"v":0,"d":"0.0%"}},{"$f":"VLOOKUP(DataID,DataRange,Data!$AH$2,FALSE)","v":{"v":0,"d":"0 "}}]
[]
[]
[null,"Comments/Observations:"]
{"$rows_empty":34}
{"$rows_left_out":17}
{"sheet":"NIE","index":15,"n_rows":87,"n_cols":26,"rows_kept":87}
{"$rows_empty":31}
[{"$nulls":3},{"$f":"B78&\" in \"&TEXT(EOMONTH(BeginDate,12),\"yyy\")","v":"Non-Interest Expense in 2022"},{"$nulls":5},{"$f":"VLOOKUP(DataID,DataRange,Data!$AF$2,FALSE)","v":{"v":0,"d":"0 "}}]
[{"$nulls":3},{"$f":"\"Budget \"&B78&\" in \"&TEXT(EOMONTH(BeginDate,24),\"yyy\")","v":"Budget Non-Interest Expense in 2023"},{"$nulls":5},{"$f":"VLOOKUP(DataID,DataRange,Data!$AG$2,FALSE)","v":{"v":0,"d":"0 "}}]
[{"$nulls":3},{"$f":"\"Change in \"&B78","v":"Change in Non-Interest Expense"},{"$nulls":4},{"$f":"IFERROR(J34/J32,0)","v":{"v":0,"d":"0.0%"}},{"$f":"VLOOKUP(DataID,DataRange,Data!$AH$2,FALSE)","v":{"v":0,"d":"0 "}}]
[]
[]
[null,"Comments/Observations:"]
{"$rows_empty":34}
{"$rows_left_out":17}
{"sheet":"Effic","index":16,"n_rows":87,"n_cols":26,"rows_kept":87}
{"$rows_empty":31}
[{"$nulls":3},{"$f":"\"Average Efficiency in \"&TEXT(EOMONTH(BeginDate,12),\"yyy\")","v":"Average Efficiency in 2022"},{"$nulls":5},{"$f":"VLOOKUP(DataID,DataRange,Data!$AF$2,FALSE)","v":{"v":0,"d":"0.0%"}}]
[{"$nulls":3},{"$f":"\"Budget Efficiency in \"&TEXT(EOMONTH(BeginDate,24),\"yyy\")","v":"Budget Efficiency in 2023"},{"$nulls":5},{"$f":"VLOOKUP(DataID,DataRange,Data!$AG$2,FALSE)","v":{"v":0,"d":"0.0%"}}]
[{"$nulls":3},"Change in Efficiency Ratio",{"$nulls":5},{"$f":"VLOOKUP(DataID,DataRange,Data!$AH$2,FALSE)","v":{"v":0,"d":"0.0%"}}]
[]
[]
[null,"Comments/Observations:"]
{"$rows_empty":34}
{"$rows_left_out":17}
{"sheet":"EOS","index":17,"n_rows":87,"n_cols":26,"rows_kept":87}
{"$rows_empty":31}
[{"$nulls":3},{"$f":"\"Average Economy of Scale in \"&TEXT(EOMONTH(BeginDate,12),\"yyy\")","v":"Average Economy of Scale in 2022"},{"$nulls":5},{"$f":"VLOOKUP(DataID,DataRange,Data!$AF$2,FALSE)","v":{"v":0,"d":"0.00%"}}]
[{"$nulls":3},{"$f":"\"Budget Economy of Scale in \"&TEXT(EOMONTH(BeginDate,24),\"yyy\")","v":"Budget Economy of Scale in 2023"},{"$nulls":5},{"$f":"VLOOKUP(DataID,DataRange,Data!$AG$2,FALSE)","v":{"v":0,"d":"0.00%"}}]
[{"$nulls":3},"Change in Economy of Scale Ratio",{"$nulls":5},{"$f":"VLOOKUP(DataID,DataRange,Data!$AH$2,FALSE)","v":{"v":0,"d":"0.00%"}}]
[]
[]
[null,"Comments/Observations:"]
{"$rows_empty":34}
{"$rows_left_out":17}
{"sheet":"NCO","index":18,"n_rows":87,"n_cols":26,"rows_kept":87}
{"$rows_empty":31}
[{"$nulls":3},{"$f":"B78&\" in \"&TEXT(EOMONTH(BeginDate,12),\"yyy\")","v":"Net Charge-Offs in 2022"},{"$nulls":5},{"$f":"VLOOKUP(DataID,DataRange,Data!$AF$2,FALSE)","v":{"v":0,"d":"0 "}},{"$f":"IFERROR(_xlfn.CONCAT(\"<-- Equal to \",TEXT(J32/Data!$AF$8,\"0.00%\"),\" of Loans\"),\"\")","v":""}]
[{"$nulls":3},{"$f":"\"Budget \"&B78&\" in \"&TEXT(EOMONTH(BeginDate,24),\"yyy\")","v":"Budget Net Charge-Offs in 2023"},{"$nulls":5},{"$f":"VLOOKUP(DataID,DataRange,Data!$AG$2,FALSE)","v":{"v":0,"d":"0 "}},{"$f":"IFERROR(_xlfn.CONCAT(\"<-- Equal to \",TEXT(J33/Data!$AG$8,\"0.00%\"),\" of Loans\"),\"\")","v":""}]
[{"$nulls":3},{"$f":"\"Change in \"&B78","v":"Change in Net Charge-Offs"},{"$nulls":4},{"$f":"IFERROR(J34/J32,0)","v":{"v":0,"d":"0.0%"}},{"$f":"VLOOKUP(DataID,DataRange,Data!$AH$2,FALSE)","v":{"v":0,"d":"0 "}},{"$f":"IFERROR(_xlfn.CONCAT(\"<-- Equal to \",TEXT(J34/Data!$AG$12,\"0.00%\"),\" ROA\"),\"\")","v":""}]
[]
[]
[null,"Comments/Observations:"]
{"$rows_empty":34}
{"$rows_left_out":17}
{"sheet":"PLLExp","index":19,"n_rows":87,"n_cols":26,"rows_kept":87}
{"$rows_empty":31}
[{"$nulls":3},{"$f":"B78&\" in \"&TEXT(EOMONTH(BeginDate,12),\"yyy\")","v":"Provision for Loan Loss Expense in 2022"},{"$nulls":5},{"$f":"VLOOKUP(DataID,DataRange,Data!$AF$2,FALSE)","v":{"v":0,"d":"0 "}},{"$f":"IFERROR(_xlfn.CONCAT(\"<-- Equal to \",TEXT(J32/Data!$AF$8,\"0.00%\"),\" of Loans\"),\"\")","v":""}]
[{"$nulls":3},{"$f":"\"Budget \"&B78&\" in \"&TEXT(EOMONTH(BeginDate,24),\"yyy\")","v":"Budget Provision for Loan Loss Expense in 2023"},{"$nulls":5},{"$f":"VLOOKUP(DataID,DataRange,Data!$AG$2,FALSE)","v":{"v":0,"d":"0 "}},{"$f":"IFERROR(_xlfn.CONCAT(\"<-- Equal to \",TEXT(J33/Data!$AG$8,\"0.00%\"),\" of Loans\"),\"\")","v":""}]
[{"$nulls":3},{"$f":"\"Change in \"&B78","v":"Change in Provision for Loan Loss Expense"},{"$nulls":4},{"$f":"IFERROR(J34/J32,0)","v":{"v":0,"d":"0.0%"}},{"$f":"VLOOKUP(DataID,DataRange,Data!$AH$2,FALSE)","v":{"v":0,"d":"0 "}},{"$f":"IFERROR(_xlfn.CONCAT(\"<-- Equal to \",TEXT(J34/Data!$AG$12,\"0.00%\"),\" ROA\"),\"\")","v":""}]
[]
[]
[null,"Comments/Observations:"]
{"$rows_empty":34}
{"$rows_left_out":17}
{"sheet":"LLRPct","index":20,"n_rows":87,"n_cols":26,"rows_kept":87}
{"$rows_empty":31}
[{"$nulls":3},{"$f":"\"Gap Between \"&TEXT(EOMONTH(BeginDate,12),\"mmm yyy\")&\" and \"&TEXT(EOMONTH(BeginDate,13),\"mmm yyy\")","v":"Gap Between Dec 2022 and Jan 2023"},{"$nulls":5},{"$f":"VLOOKUP(DataID,DataRange,Data!S$2,FALSE)-VLOOKUP(DataID,DataRange,Data!Q$2,FALSE)","v":{"v":0,"d":"0.00%"}}]
[]
[]
[]
[]
[null,"Comments/Observations:"]
{"$rows_empty":34}
{"$rows_left_out":17}
{"sheet":"TSR","index":21,"n_rows":87,"n_cols":26,"rows_kept":87}
{"$rows_empty":31}
[{"$nulls":3},{"$f":"\"Gap Between \"&TEXT(EOMONTH(BeginDate,12),\"mmm yyy\")&\" and \"&TEXT(EOMONTH(BeginDate,13),\"mmm yyy\")","v":"Gap Between Dec 2022 and Jan 2023"},{"$nulls":5},{"$f":"VLOOKUP(DataID,DataRange,Data!S$2,FALSE)-VLOOKUP(DataID,DataRange,Data!Q$2,FALSE)","v":{"v":0,"d":"0.0%"}}]
[]
[]
[]
[]
[null,"Comments/Observations:"]
{"$rows_empty":34}
{"$rows_left_out":17}
{"sheet":"EqAssets","index":22,"n_rows":87,"n_cols":26,"rows_kept":87}
{"$rows_empty":31}
[{"$nulls":3},{"$f":"\"Gap Between \"&TEXT(EOMONTH(BeginDate,12),\"mmm yyy\")&\" and \"&TEXT(EOMONTH(BeginDate,13),\"mmm yyy\")","v":"Gap Between Dec 2022 and Jan 2023"},{"$nulls":5},{"$f":"VLOOKUP(DataID,DataRange,Data!S$2,FALSE)-VLOOKUP(DataID,DataRange,Data!Q$2,FALSE)","v":{"v":0,"d":"0.0%"}}]
[]
[]
[]
[]
[null,"Comments/Observations:"]
{"$rows_empty":34}
{"$rows_left_out":17}
{"sheet":"NetInc","index":23,"n_rows":87,"n_cols":26,"rows_kept":87}
{"$rows_empty":31}
[{"$nulls":3},{"$f":"B78&\" in \"&TEXT(EOMONTH(BeginDate,12),\"yyy\")","v":"Pretax Operating Net Income in 2022"},{"$nulls":5},{"$f":"VLOOKUP(DataID,DataRange,Data!$AF$2,FALSE)","v":{"v":0,"d":"0 "}}]
[{"$nulls":3},{"$f":"\"Budget \"&B78&\" in \"&TEXT(EOMONTH(BeginDate,24),\"yyy\")","v":"Budget Pretax Operating Net Income in 2023"},{"$nulls":5},{"$f":"VLOOKUP(DataID,DataRange,Data!$AG$2,FALSE)","v":{"v":0,"d":"0 "}}]
[{"$nulls":3},{"$f":"\"Change in \"&B78","v":"Change in Pretax Operating Net Income"},{"$nulls":4},{"$f":"IFERROR(J34/J32,0)","v":{"v":0,"d":"0.0%"}},{"$f":"VLOOKUP(DataID,DataRange,Data!$AH$2,FALSE)","v":{"v":0,"d":"0 "}}]
[]
[]
[null,"Comments/Observations:"]
{"$rows_empty":34}
{"$rows_left_out":17}
{"sheet":"ROA","index":24,"n_rows":87,"n_cols":26,"rows_kept":87}
[null,"`"]
{"$rows_empty":30}
[{"$nulls":3},{"$f":"B78&\" in \"&TEXT(EOMONTH(BeginDate,12),\"yyy\")","v":"Pretax Operating ROA in 2022"},{"$nulls":5},{"$f":"VLOOKUP(DataID,DataRange,Data!$AF$2,FALSE)","v":{"v":0,"d":"0.00%"}}]
[{"$nulls":3},{"$f":"\"Budget \"&B78&\" in \"&TEXT(EOMONTH(BeginDate,24),\"yyy\")","v":"Budget Pretax Operating ROA in 2023"},{"$nulls":5},{"$f":"VLOOKUP(DataID,DataRange,Data!$AG$2,FALSE)","v":{"v":0,"d":"0.00%"}}]
[{"$nulls":3},{"$f":"\"Change in \"&B78","v":"Change in Pretax Operating ROA"},{"$nulls":5},{"$f":"VLOOKUP(DataID,DataRange,Data!$AH$2,FALSE)","v":{"v":0,"d":"0.00%"}}]
[]
[]
[null,"Comments/Observations:"]
{"$rows_left_out":18}
{"sheet":"RateVolData","index":25,"n_rows":30,"n_cols":18,"rows_kept":30,"hidden":true,"merged":[[1,16,1,17]]}
[]
[null,null,"22 Actual","23 Budget",null,"Change","Yield","Cost","Spread",null,"Impact",{"$nulls":5},"Alloc R x V Var"]
["B1","Lns",{"$f":"IFERROR(AVERAGE(Data!E8:Q8),0)","v":0},{"$f":"IFERROR(AVERAGE(Data!Q8,Data!S8:AD8),0)","v":0},null,{"$f":"D3-C3","v":0},{"$f":"C13","v":{"v":0,"d":"0.00%"}},{"$f":"C14","v":{"v":0,"d":"0.00%"}},{"$f":"G3-H3","v":{"v":0,"d":"0.00%"}},null,{"$f":"F3*I3+R3","v":0},"Change in Avg Bal x Prior Year Spread",{"$nulls":4},{"$f":"IFERROR(D3/SUM($D$3:$D$11),0)","v":{"v":0,"d":"0.0%"}},{"$f":"Q3*$R$18","v":0}]
[null,"Surplus",{"$f":"IFERROR(AVERAGE(Data!E9:Q9),0)","v":0},{"$f":"IFERROR(AVERAGE(Data!Q9,Data!S9:AD9),0)","v":0},null,{"$f":"D4-C4","v":0},{"$f":"C14","v":{"v":0,"d":"0.00%"}},{"$f":"$H$3","v":{"v":0,"d":"0.00%"}},{"$f":"G4-H4","v":{"v":0,"d":"0.00%"}},null,{"$f":"F4*I4+R4","v":0},"Change in Avg Bal x Prior Year Spread",{"$nulls":4},{"$f":"IFERROR(D4/SUM($D$3:$D$11),0)","v":{"v":0,"d":"0.0%"}},{"$f":"Q4*$R$18","v":0}]
[null,"LLR",{"$f":"IFERROR(AVERAGE(Data!E10:Q10),0)","v":0},{"$f":"IFERROR(AVERAGE(Data!Q10,Data!S10:AD10),0)","v":0},null,{"$f":"D5-C5","v":0},{"$f":"$H$3","v":{"v":0,"d":"0.00%"}},{"v":0,"d":"0.00%"},{"v":0,"d":"0.00%"},null,0,"Change in Avg Bal x Prior Year Spread",{"$nulls":4},{"v":0,"d":"0.0%"},0]
[null,"NEA",{"$f":"IFERROR(AVERAGE(Data!E11:Q11),0)","v":0},{"$f":"IFERROR(AVERAGE(Data!Q11,Data!S11:AD11),0)","v":0},null,{"$f":"D6-C6","v":0},{"v":0,"d":"0.00%"},{"$f":"$H$3","v":{"v":0,"d":"0.00%"}},{"v":0,"d":"0.00%"},null,0,"Change in Avg Bal x Prior Year Spread",{"$nulls":4},{"v":0,"d":"0.0%"},0]
[]
["B6","Rel Bal",{"$f":"IFERROR(AVERAGE(Data!E14:Q14),0)","v":0},{"$f":"IFERROR(AVERAGE(Data!Q14,Data!S14:AD14),0)","v":0},null,{"$f":"D8-C8","v":0},{"$f":"$H$3","v":{"v":0,"d":"0.00%"}},{"$f":"C15","v":{"v":0,"d":"0.00%"}},{"$f":"G8-H8","v":{"v":0,"d":"0.00%"}},null,{"$f":"F8*I8+R8","v":0},"Change in Avg Bal x Prior Year Spread",{"$nulls":4},{"$f":"IFERROR(D8/SUM($D$3:$D$11),0)","v":{"v":0,"d":"0.0%"}},0]
{"$rows_left_out":22}